coruscation-n
type: LexicalEntry
canonical form: coruscation
sense: 05627686-n
part of speech: noun

05627686-n
type: LexicalConcept
in scheme: en-word.net
definition: a sudden or striking display of brilliance
example: coruscations of great wit
ili: i66440
lexfile: noun.cognition
part of speech: noun
hypernym: 05627526-n