feature-n
type: LexicalEntry
canonical form: feature
sense: 05609513-n
part of speech: noun

lineament-n
type: LexicalEntry
canonical form: lineament
sense: 05609513-n
part of speech: noun

05609513-n
type: LexicalConcept
in scheme: en-word.net
definition: the characteristic parts of a person's face: eyes and nose and mouth and chin
example: an expression of pleasure crossed his features
example: his lineaments were very regular
ili: i66348
lexfile: noun.body
part of speech: noun
hypernym: 05227735-n