nose-n
type: LexicalEntry
canonical form: nose
sense: 05605902-n
part of speech: noun

olfactory organ-n
type: LexicalEntry
canonical form: olfactory organ
sense: 05605902-n
part of speech: noun

05605902-n
type: LexicalConcept
in scheme: en-word.net
definition: the organ of smell and entrance to the respiratory tract; the prominent part of the face of man or other mammals
example: he has a cold in the nose
ili: i66329
lexfile: noun.body
part of speech: noun
hypernym: 05307730-n
mero part: 05291315-n
mero part: 05352396-n
mero part: 05536237-n
mero part: 05552065-n
mero part: 05606958-n
mero part: 05607864-n