column-n
type: LexicalEntry
canonical form: column
sense: 05593649-n
part of speech: noun

05593649-n
type: LexicalConcept
in scheme: en-word.net
definition: any tubular or pillar-like supporting structure in the body
ili: i66269
lexfile: noun.body
part of speech: noun
hypernym: 05593315-n