nail-n
type: LexicalEntry
canonical form: nail
sense: 05589324-n
part of speech: noun

05589324-n
type: LexicalConcept
in scheme: en-word.net
definition: horny plate covering and protecting part of the dorsal surface of the digits
ili: i66246
lexfile: noun.body
part of speech: noun
hypernym: 05589145-n
mero part: 05315809-n
mero part: 05589688-n
mero part: 05589841-n