finger-n
type: LexicalEntry
canonical form: finger
sense: 05574137-n
part of speech: noun

05574137-n
type: LexicalConcept
in scheme: en-word.net
definition: any of the terminal members of the hand (sometimes excepting the thumb)
example: her fingers were long and thin
ili: i66162
lexfile: noun.body
part of speech: noun
hypernym: 05573730-n
hypernym: 05574552-n
mero part: 02443154-n
mero part: 05574750-n
mero part: 05591915-n
mero part: 05592855-n