breast-n
type: LexicalEntry
canonical form: breast
sense: 05560921-n
part of speech: noun

chest-n
type: LexicalEntry
canonical form: chest
sense: 05560921-n
part of speech: noun

05560921-n
type: LexicalConcept
in scheme: en-word.net
definition: the front of the trunk from the neck to the abdomen
example: he beat his breast in anger
ili: i66099
lexfile: noun.body
part of speech: noun
domain topic: 00845915-n
hypernym: 05232383-n