medulla-n
type: LexicalEntry
canonical form: medulla
sense: 05498451-n
part of speech: noun

05498451-n
type: LexicalConcept
in scheme: en-word.net
definition: the inner part of an organ or structure in plant or animal
ili: i65797
lexfile: noun.body
part of speech: noun
hypernym: 05275047-n
hypernym: 13116444-n