yellow bile-n
type: LexicalEntry
canonical form: yellow bile
sense: 05414301-n
part of speech: noun

choler-n
type: LexicalEntry
canonical form: choler
sense: 05414301-n
part of speech: noun

05414301-n
type: LexicalConcept
in scheme: en-word.net
definition: a humor that was once believed to be secreted by the liver and to cause irritability and anger
ili: i65384
lexfile: noun.body
part of speech: noun
hypernym: 05404811-n