bile-n
type: LexicalEntry
canonical form: bile
sense: 05413913-n
part of speech: noun

gall-n
type: LexicalEntry
canonical form: gall
sense: 05413913-n
part of speech: noun

05413913-n
type: LexicalConcept
in scheme: en-word.net
definition: a digestive juice secreted by the liver and stored in the gallbladder; aids in the digestion of fats
ili: i65382
lexfile: noun.body
part of speech: noun
hypernym: 05413289-n