milk-n
type: LexicalEntry
canonical form: milk
sense: 05406377-n
part of speech: noun

05406377-n
type: LexicalConcept
in scheme: en-word.net
definition: produced by mammary glands of female mammals for feeding their young
ili: i65344
lexfile: noun.body
part of speech: noun
domain topic: 00845915-n
hypernym: 05404811-n
hypernym: 07586285-n