pupil-n
type: LexicalEntry
canonical form: pupil
sense: 05327733-n
part of speech: noun

05327733-n
type: LexicalConcept
in scheme: en-word.net
definition: the contractile aperture in the center of the iris of the eye; resembles a large black dot
ili: i64917
lexfile: noun.body
part of speech: noun
hypernym: 09223909-n