root-n
type: LexicalEntry
canonical form: root
sense: 05315809-n
part of speech: noun

05315809-n
type: LexicalConcept
in scheme: en-word.net
definition: the embedded part of a bodily structure such as a tooth, nail, or hair
ili: i64853
lexfile: noun.body
part of speech: noun
hypernym: 05232895-n
mero part: 05316335-n