vestibule-n
type: LexicalEntry
canonical form: vestibule
sense: 05312102-n
part of speech: noun

05312102-n
type: LexicalConcept
in scheme: en-word.net
definition: any of various bodily cavities leading to another cavity (as of the ear or vagina)
ili: i64831
lexfile: noun.body
part of speech: noun
hypernym: 05310901-n