cloaca-n
type: LexicalEntry
canonical form: cloaca
sense: 05311840-n
part of speech: noun

05311840-n
type: LexicalConcept
in scheme: en-word.net
definition: (zoology) the cavity (in birds, reptiles, amphibians, most fish, and monotremes but not other mammals) at the end of the digestive tract into which the intestinal, genital, and urinary tracts open
ili: i64830
lexfile: noun.body
part of speech: noun
domain topic: 06092831-n
hypernym: 05310901-n