tendon-n
type: LexicalEntry
canonical form: tendon
sense: 05303752-n
part of speech: noun

sinew-n
type: LexicalEntry
canonical form: sinew
sense: 05303752-n
part of speech: noun

05303752-n
type: LexicalConcept
in scheme: en-word.net
definition: a cord or band of inelastic tissue connecting a muscle with its bony attachment
ili: i64793
lexfile: noun.body
part of speech: noun
hypernym: 05294035-n
mero substance: 05294589-n