tooth socket-n
type: LexicalEntry
canonical form: tooth socket
sense: 05292979-n
part of speech: noun

alveolus-n
type: LexicalEntry
canonical form: alveolus
sense: 05292979-n
part of speech: noun

05292979-n
type: LexicalConcept
in scheme: en-word.net
definition: a bony socket in the alveolar ridge that holds a tooth
ili: i64736
lexfile: noun.body
part of speech: noun
hypernym: 05288330-n