flesh-n
type: LexicalEntry
canonical form: flesh
sense: 05275611-n
part of speech: noun

05275611-n
type: LexicalConcept
in scheme: en-word.net
definition: the soft tissue of the body of a vertebrate: mainly muscle tissue and fat
ili: i64648
lexfile: noun.body
part of speech: noun
hypernym: 05275047-n