groove-n
type: LexicalEntry
canonical form: groove
sense: 05229884-n
part of speech: noun

vallecula-n
type: LexicalEntry
canonical form: vallecula
sense: 05229884-n
part of speech: noun

05229884-n
type: LexicalConcept
in scheme: en-word.net
definition: (anatomy) any furrow or channel on a bodily structure or part
ili: i64404
lexfile: noun.body
part of speech: noun
domain topic: 06067070-n
hypernym: 05227735-n