corpus-n
type: LexicalEntry
canonical form: corpus
sense: 05228819-n
part of speech: noun

05228819-n
type: LexicalConcept
in scheme: en-word.net
definition: the main part of an organ or other bodily structure
ili: i64400
lexfile: noun.body
part of speech: noun
hypernym: 09408804-n