capability-n
type: LexicalEntry
canonical form: capability
sense: 05209765-n
part of speech: noun

capableness-n
type: LexicalEntry
canonical form: capableness
sense: 05209765-n
part of speech: noun

05209765-n
type: LexicalConcept
in scheme: en-word.net
definition: the quality of being capable — physically or intellectually or legally
example: he worked to the limits of his capability
ili: i64310
lexfile: noun.attribute
part of speech: noun
attribute: https://en-word.net/synset/00307112-a
attribute: https://en-word.net/synset/00308272-a
hypernym: 05207437-n