muscle-n
type: LexicalEntry
canonical form: muscle
sense: 05205400-n
part of speech: noun

05205400-n
type: LexicalConcept
in scheme: en-word.net
definition: authority or power or force (especially when used in a coercive way)
example: the senators used their muscle to get the party leader to resign
ili: i64288
lexfile: noun.attribute
part of speech: noun
hypernym: 05203850-n