use-n
type: LexicalEntry
canonical form: use
sense: 05197374-n
part of speech: noun

enjoyment-n
type: LexicalEntry
canonical form: enjoyment
sense: 05197374-n
part of speech: noun

05197374-n
type: LexicalConcept
in scheme: en-word.net
definition: (law) the exercise of the legal right to enjoy the benefits of owning property
example: we were given the use of his boat
ili: i64250
lexfile: noun.attribute
part of speech: noun
domain topic: 08458195-n
hypernym: 05184812-n