entitlement-n
type: LexicalEntry
canonical form: entitlement
sense: 05189022-n
part of speech: noun

05189022-n
type: LexicalConcept
in scheme: en-word.net
definition: right granted by law or contract (especially a right to benefits)
example: entitlements make up the major part of the federal budget
ili: i64204
lexfile: noun.attribute
part of speech: noun
domain topic: 08458195-n
hypernym: 05188726-n