edge-n
type: LexicalEntry
canonical form: edge
sense: 05179505-n
part of speech: noun

sharpness-n
type: LexicalEntry
canonical form: sharpness
sense: 05179505-n
part of speech: noun

05179505-n
type: LexicalConcept
in scheme: en-word.net
definition: the attribute of urgency in tone of voice
example: his voice had an edge to it
ili: i64159
lexfile: noun.attribute
part of speech: noun
hypernym: 05179327-n