importance-n
type: LexicalEntry
canonical form: importance
sense: 05175788-n
part of speech: noun

05175788-n
type: LexicalConcept
in scheme: en-word.net
definition: the quality of being important and worthy of note
example: the importance of a well-balanced diet
ili: i64140
lexfile: noun.attribute
part of speech: noun
attribute: https://en-word.net/synset/01278672-a
attribute: https://en-word.net/synset/01283088-a
hypernym: 05145753-n