penalty-n
type: LexicalEntry
canonical form: penalty
sense: 05172372-n
part of speech: noun

05172372-n
type: LexicalConcept
in scheme: en-word.net
definition: the disadvantage or painful consequences of an action or condition
example: neglected his health and paid the penalty
ili: i64122
lexfile: noun.attribute
part of speech: noun
hypernym: 05169087-n