penalty-n
type: LexicalEntry
canonical form: penalty
sense: 05170716-n
part of speech: noun

05170716-n
type: LexicalConcept
in scheme: en-word.net
definition: (games) a handicap or disadvantage that is imposed on a competitor (or a team) for an infraction of the rules of the game
ili: i64114
lexfile: noun.attribute
part of speech: noun
domain topic: 00456623-n
hypernym: 05164205-n