profit-n
type: LexicalEntry
canonical form: profit
sense: 05164957-n
part of speech: noun

gain-n
type: LexicalEntry
canonical form: gain
sense: 05164957-n
part of speech: noun

05164957-n
type: LexicalConcept
in scheme: en-word.net
definition: the advantageous quality of being beneficial
ili: i64085
lexfile: noun.attribute
part of speech: noun
hypernym: 05163204-n