favor-n
type: LexicalEntry
canonical form: favor
sense: 05163702-n
part of speech: noun

favour-n
type: LexicalEntry
canonical form: favour
sense: 05163702-n
part of speech: noun

05163702-n
type: LexicalConcept
in scheme: en-word.net
definition: an advantage to the benefit of someone or something
example: the outcome was in his favor
ili: i64077
lexfile: noun.attribute
part of speech: noun
hypernym: 05163204-n