resourcefulness-n
type: LexicalEntry
canonical form: resourcefulness
sense: 05162859-n
part of speech: noun

05162859-n
type: LexicalConcept
in scheme: en-word.net
definition: the quality of being able to cope with a difficult situation
example: a man of great resourcefulness
ili: i64074
lexfile: noun.attribute
part of speech: noun
hypernym: 05161923-n