instrumentality-n
type: LexicalEntry
canonical form: instrumentality
sense: 05157705-n
part of speech: noun

05157705-n
type: LexicalConcept
in scheme: en-word.net
definition: the quality of being instrumental for some purpose
ili: i64047
lexfile: noun.attribute
part of speech: noun
hypernym: 05155946-n