advantage-n
type: LexicalEntry
canonical form: advantage
sense: 05150110-n
part of speech: noun

reward-n
type: LexicalEntry
canonical form: reward
sense: 05150110-n
part of speech: noun

05150110-n
type: LexicalConcept
in scheme: en-word.net
definition: benefit resulting from some event or action
example: it turned out to my advantage
example: reaping the rewards of generosity
ili: i64012
lexfile: noun.attribute
part of speech: noun
hypernym: 05149888-n