gold-n
type: LexicalEntry
canonical form: gold
sense: 05148739-n
part of speech: noun

05148739-n
type: LexicalConcept
in scheme: en-word.net
definition: something likened to the metal in brightness or preciousness or superiority etc.
example: the child was as good as gold
example: she has a heart of gold
ili: i64006
lexfile: noun.attribute
part of speech: noun
hypernym: 05148469-n