frontage-n
type: LexicalEntry
canonical form: frontage
sense: 05131200-n
part of speech: noun

05131200-n
type: LexicalConcept
in scheme: en-word.net
definition: the extent of land abutting on a street or water
ili: i63915
lexfile: noun.attribute
part of speech: noun
domain topic: 09434308-n
hypernym: 05130681-n