amplification-n
type: LexicalEntry
canonical form: amplification
sense: 05116624-n
part of speech: noun

gain-n
type: LexicalEntry
canonical form: gain
sense: 05116624-n
part of speech: noun

05116624-n
type: LexicalConcept
in scheme: en-word.net
definition: the amount of increase in signal power or voltage or current expressed as the ratio of output to input
ili: i63845
lexfile: noun.attribute
part of speech: noun
hypernym: 05116247-n