elevation-n
type: LexicalEntry
canonical form: elevation
sense: 05094110-n
part of speech: noun

05094110-n
type: LexicalConcept
in scheme: en-word.net
definition: (ballet) the height of a dancer's leap or jump
example: a dancer of exceptional elevation
ili: i63728
lexfile: noun.attribute
part of speech: noun
domain topic: 00529704-n
hypernym: 05093947-n