address-n
type: LexicalEntry
canonical form: address
sense: 05089855-n
part of speech: noun

05089855-n
type: LexicalConcept
in scheme: en-word.net
definition: the stance assumed by a golfer in preparation for hitting a golf ball
ili: i63706
lexfile: noun.attribute
part of speech: noun
domain topic: 00465962-n
hypernym: 05089714-n