coincidence-n
type: LexicalEntry
canonical form: coincidence
sense: 05084830-n
part of speech: noun

05084830-n
type: LexicalConcept
in scheme: en-word.net
definition: the quality of occupying the same position or area in space
example: he waited for the coincidence of the target and the cross hairs
ili: i63677
lexfile: noun.attribute
part of speech: noun
hypernym: 05081943-n