point of view-n
type: LexicalEntry
canonical form: point of view
sense: 05083406-n
part of speech: noun

05083406-n
type: LexicalConcept
in scheme: en-word.net
definition: the spatial property of the position from which something is observed
ili: i63669
lexfile: noun.attribute
part of speech: noun
hypernym: 05081943-n