gradualness-n
type: LexicalEntry
canonical form: gradualness
sense: 05077022-n
part of speech: noun

gentleness-n
type: LexicalEntry
canonical form: gentleness
sense: 05077022-n
part of speech: noun

05077022-n
type: LexicalConcept
in scheme: en-word.net
definition: the property possessed by a slope that is very gradual
ili: i63637
lexfile: noun.attribute
part of speech: noun
hypernym: 05075630-n