loft-n
type: LexicalEntry
canonical form: loft
sense: 05076616-n
part of speech: noun

05076616-n
type: LexicalConcept
in scheme: en-word.net
definition: (golf) the backward slant on the head of some golf clubs that is designed to drive the ball high in the air
ili: i63635
lexfile: noun.attribute
part of speech: noun
domain topic: 00465962-n
hypernym: 05076368-n