graduality-n
type: LexicalEntry
canonical form: graduality
sense: 05068974-n
part of speech: noun

gradualness-n
type: LexicalEntry
canonical form: gradualness
sense: 05068974-n
part of speech: noun

05068974-n
type: LexicalConcept
in scheme: en-word.net
definition: the quality of being gradual or of coming about by gradual stages
ili: i63596
lexfile: noun.attribute
part of speech: noun
hypernym: 05065291-n