strength-n
type: LexicalEntry
canonical form: strength
sense: 05036872-n
part of speech: noun

05036872-n
type: LexicalConcept
in scheme: en-word.net
definition: the property of being physically or mentally strong
example: fatigue sapped his strength
ili: i63432
lexfile: noun.attribute
part of speech: noun
attribute: https://en-word.net/synset/00709335-a
attribute: https://en-word.net/synset/00710810-a
attribute: https://en-word.net/synset/02328781-a
attribute: https://en-word.net/synset/02332106-a
hypernym: 04923519-n