tare-n
type: LexicalEntry
canonical form: tare
sense: 05035595-n
part of speech: noun

05035595-n
type: LexicalConcept
in scheme: en-word.net
definition: the weight of a motor vehicle, railroad car, or aircraft without its fuel or cargo
ili: i63425
lexfile: noun.attribute
part of speech: noun
hypernym: 05034009-n