warmth-n
type: LexicalEntry
canonical form: warmth
sense: 05023937-n
part of speech: noun

warmness-n
type: LexicalEntry
canonical form: warmness
sense: 05023937-n
part of speech: noun

05023937-n
type: LexicalConcept
in scheme: en-word.net
definition: the quality of having a moderate degree of heat
example: an agreeable warmth in the house
ili: i63365
lexfile: noun.attribute
part of speech: noun
hypernym: 05023355-n