texture-n
type: LexicalEntry
canonical form: texture
sense: 04991256-n
part of speech: noun

04991256-n
type: LexicalConcept
in scheme: en-word.net
definition: the musical pattern created by parts being played or sung together
example: then another melodic line is added to the texture
ili: i63192
lexfile: noun.attribute
part of speech: noun
hypernym: 04990651-n