sound-n
type: LexicalEntry
canonical form: sound
sense: 04988388-n
part of speech: noun

04988388-n
type: LexicalConcept
in scheme: en-word.net
definition: the particular auditory effect produced by a given cause
example: the sound of rain on the roof
example: the beautiful sound of music
ili: i63177
lexfile: noun.attribute
part of speech: noun
hypernym: 04990371-n