white-n
type: LexicalEntry
canonical form: white
sense: 04967906-n
part of speech: noun

whiteness-n
type: LexicalEntry
canonical form: whiteness
sense: 04967906-n
part of speech: noun

04967906-n
type: LexicalConcept
in scheme: en-word.net
definition: the quality or state of the achromatic color of greatest lightness (bearing the least resemblance to black)
ili: i63042
lexfile: noun.attribute
part of speech: noun
hypernym: 04967256-n