retentiveness-n
type: LexicalEntry
canonical form: retentiveness
sense: 04953577-n
part of speech: noun

retentivity-n
type: LexicalEntry
canonical form: retentivity
sense: 04953577-n
part of speech: noun

04953577-n
type: LexicalConcept
in scheme: en-word.net
definition: the property of retaining possessions that have been acquired
ili: i62972
lexfile: noun.attribute
part of speech: noun
hypernym: 04953255-n